{"text_format":"1","workbook":"xlsx","n_sheets":2,"sheets":["登録ナンバーなし（記入例）","登録ナンバーなし"],"not_rendered":{"charts":0,"images":0,"macros":1,"external_links":0,"defined_names":2,"comments":0,"pivot_tables":0},"unopened":[],"bounds":{"document_bytes":16777216,"sheet_cells":100000,"rows_first":2000,"rows_last":500,"rows_between":2000,"halvings":0,"cell_chars":16384,"cell_head_chars":4096},"cells_cut":0,"cells_raw":0,"read":"whole","date_system":"1900"}

{"sheet":"登録ナンバーなし（記入例）","index":0,"n_rows":39,"n_cols":86,"rows_kept":39,"cut":false,"hidden":false,"merged":[[32,45,32,47],[32,48,32,53],[35,15,36,31],[31,45,31,47],[31,48,31,50],[31,51,31,53],[31,42,31,44],[32,35,32,37],[31,25,32,26],[31,27,31,29],[31,30,31,34],[31,35,31,37],[32,42,32,44],[32,27,32,29],[32,30,32,34],[31,38,31,40],[32,38,32,41],[29,0,30,0],[29,1,29,8],[29,9,30,12],[29,13,29,14],[29,15,30,18],[29,19,30,24],[29,27,29,29],[30,42,30,44],[31,0,32,0],[31,1,31,8],[31,9,32,12],[31,13,31,14],[31,15,32,18],[31,19,32,24],[32,1,32,8],[32,13,32,14],[30,1,30,8],[30,13,30,14],[29,38,29,40],[30,38,30,41],[28,35,28,37],[27,25,28,26],[27,27,27,29],[27,30,27,34],[27,35,27,37],[27,42,27,44],[30,27,30,29],[30,30,30,34],[30,35,30,37],[29,25,30,26],[29,30,29,34],[29,35,29,37],[29,42,29,44],[27,38,27,40],[28,38,28,41],[27,0,28,0],[27,1,27,8],[27,9,28,12],[27,13,27,14],[27,15,28,18],[27,19,28,24],[26,13,26,14],[26,27,26,29],[26,30,26,34],[28,1,28,8],[28,13,28,14],[28,27,28,29],[28,30,28,34],[26,35,26,37],[25,25,26,26],[25,30,25,34],[25,35,25,37],[25,42,25,44],[25,0,26,0],[25,1,25,8],[25,9,26,12],[25,13,25,14],[25,15,26,18],[25,19,26,24],[25,27,25,29],[26,1,26,8],[26,42,26,44],[25,38,25,40],[26,38,26,41],[23,45,23,47],[23,48,23,50],[23,51,23,53],[24,1,24,8],[24,13,24,14],[24,27,24,29],[24,30,24,34],[24,35,24,37],[23,25,24,26],[23,27,23,29],[23,30,23,34],[23,35,23,37],[23,42,23,44],[24,42,24,44],[24,45,24,47],[24,48,24,53],[23,38,23,40],[24,38,24,41],[21,0,22,0],[21,1,21,8],[21,9,22,12],[21,13,21,14],[21,15,22,18],[21,19,22,24],[21,27,21,29],[22,1,22,8],[23,0,24,0],[23,1,23,8],[23,9,24,12],[23,13,23,14],[23,15,24,18],[23,19,24,24],[22,13,22,14],[22,27,22,29],[20,35,20,37],[19,25,20,26],[19,27,19,29],[19,30,19,34],[19,35,19,37],[19,42,19,44],[22,35,22,37],[21,25,22,26],[21,30,21,34],[21,35,21,37],[21,42,21,44],[22,30,22,34],[19,38,19,40],[20,38,20,41],[21,38,21,40],[22,38,22,41],[19,0,20,0],[19,1,19,8],[19,9,20,12],[19,13,19,14],[19,15,20,18],[19,19,20,24],[18,13,18,14],[18,27,18,29],[18,30,18,34],[20,1,20,8],[20,13,20,14],[20,27,20,29],[20,30,20,34],[18,35,18,37],[17,25,18,26],[17,30,17,34],[17,35,17,37],[17,42,17,44],[17,0,18,0],[17,1,17,8],[17,9,18,12],[17,13,17,14],[17,15,18,18],[17,19,18,24],[17,27,17,29],[18,1,18,8],[18,42,18,44],[17,38,17,40],[18,38,18,41],[15,45,15,47],[15,48,15,50],[15,51,15,53],[16,1,16,8],[16,13,16,14],[16,27,16,29],[16,30,16,34],[16,35,16,37],[15,25,16,26],[15,27,15,29],[15,30,15,34],[15,35,15,37],[15,42,15,44],[16,45,16,47],[16,48,16,53],[15,38,15,40],[16,38,16,41],[15,0,16,0],[15,1,15,8],[15,9,16,12],[15,13,15,14],[15,15,16,18],[15,19,16,24],[13,48,13,50],[13,51,13,53],[14,1,14,8],[14,13,14,14],[14,27,14,29],[14,30,14,34],[14,35,14,37],[13,25,14,26],[14,48,14,53],[13,0,14,0],[13,1,13,8],[13,9,14,12],[13,13,13,14],[13,15,14,18],[13,45,13,47],[14,42,14,44],[14,45,14,47],[16,42,16,44],[12,1,12,8],[12,13,12,14],[12,25,12,26],[12,30,12,34],[12,35,12,37],[13,27,13,29],[13,30,13,34],[13,35,13,37],[11,19,12,24],[11,25,11,26],[10,42,10,50],[12,42,12,44],[12,45,12,47],[12,48,12,53],[13,19,14,24],[11,42,11,44],[11,45,11,47],[11,48,11,50],[11,51,11,53],[13,42,13,44],[11,27,12,29],[11,30,11,34],[11,35,11,37],[11,38,11,40],[12,38,12,41],[13,38,13,40],[14,38,14,41],[11,0,12,0],[11,1,11,8],[11,9,12,12],[11,13,11,14],[11,15,12,18],[7,33,8,35],[7,37,8,42],[7,27,8,27],[7,28,8,28],[7,29,8,29],[7,30,8,30],[7,31,8,31],[7,32,8,32],[7,21,8,21],[7,22,8,22],[7,23,8,23],[7,24,8,24],[7,25,8,25],[7,26,8,26],[7,15,8,15],[7,16,8,16],[7,17,8,17],[7,18,8,18],[7,19,8,19],[7,20,8,20],[6,0,6,10],[6,11,6,21],[6,22,6,32],[6,33,6,35],[6,37,6,50],[7,0,8,10],[7,11,8,11],[7,12,8,12],[7,13,8,13],[7,14,8,14],[7,47,8,47],[7,48,8,48],[7,43,8,43],[7,44,8,44],[7,45,8,45],[7,46,8,46],[7,49,8,49],[7,50,8,53],[0,1,1,16],[0,37,0,39],[0,41,0,53],[1,37,1,53],[2,1,3,16],[2,37,2,53],[3,37,3,39],[3,40,3,50],[3,51,6,53],[4,37,5,50],[18,45,18,47],[18,48,18,53],[17,45,17,47],[17,48,17,50],[17,51,17,53],[20,42,20,44],[20,45,20,47],[20,48,20,53],[22,42,22,44],[22,45,22,47],[22,48,22,53],[21,45,21,47],[21,48,21,50],[21,51,21,53],[19,45,19,47],[19,48,19,50],[19,51,19,53],[26,45,26,47],[26,48,26,53],[25,45,25,47],[25,48,25,50],[25,51,25,53],[30,45,30,47],[30,48,30,53],[28,42,28,44],[28,45,28,47],[28,48,28,53],[29,45,29,47],[29,48,29,50],[29,51,29,53],[27,45,27,47],[27,48,27,50],[27,51,27,53]]}
[null,"　納　品　書　",null,null,null,null,null,null,null,null,null,null,null,null,null,null,null,null,null,null,null,null,null,null,null,null,null,null,null,null,null,null,null,null,null,null,null,"住所",null,null,"〒","123-4567"]
[null,null,null,null,null,null,null,null,null,null,null,null,null,null,null,null,null,null,null,null,null,null,null,null,null,null,null,null,null,null,null,null,null,null,null,null,null,"東京都○○○○○○○○123-45"]
[null,"株式会社　東海大阪レンタル　御中"]
[null,null,null,null,null,null,null,null,null,null,null,null,null,null,null,null,null,null,null,null,null,null,null,null,null,null,null,null,null,null,null,null,null,null,null,null,null,"社名",null,null,null,null,null,null,null,null,null,null,null,null,null,"印"]
[null,null,null,null,null,null,null,null,null,null,null,null,null,null,null,null,null,null,null,null,null,null,null,null,null,null,null,null,null,null,null,null,null,null,null,null,null,"株式会社○○○○○○○○"]
[]
["納　入　部　門　名",null,null,null,null,null,null,null,null,null,null,"注　文　番　号（11桁）",null,null,null,null,null,null,null,null,null,null,"納 入 年 月 日",null,null,null,null,null,null,null,null,null,null,"新品・中古区分"]
["●▲■営業所",null,null,null,null,null,null,null,null,null,null,1,2,3,4,5,6,7,8,9,1,0,null,0,1,7,"年",0,null,"月",1,2,"日","0：新品",null,null,null,"取引先コード(7桁)",null,null,null,null,null,1,2,3,4,5,6,7,"000"]
[]
[]
["【商　品　詳　細　情　報　　報　告　書】",null,null,null,null,null,null,null,null,null,null,null,null,null,null,null,null,null,null,null,null,null,null,null,null,null,null,null,null,null,null,null,null,null,null,null,null,null,null,null,null,null,"（寸法）"]
["No","機種（品名）",null,null,null,null,null,null,null,"東海大阪レンタル\n管理番号",null,null,null,"数量",null,"TOR商品\n確認印",null,null,null,"製造番号",null,null,null,null,null,"製造年月",null,"原動機\nメーカー",null,null,"原動機　型式",null,null,null,null,"騒音区分",null,null,"バッテリーサイズ",null,null,"個数","長さ\nL（ｍｍ）",null,null,"幅\nW （ｍｍ）",null,null,"高さ\nH （ｍｍ）",null,null,"重量 \n機械質量（㎏）"]
[null,"性能（規格・型式）",null,null,null,null,null,null,null,null,null,null,null,"単位",null,null,null,null,null,null,null,null,null,null,null,"(西暦4桁）",null,null,null,null,"原動機　番号",null,null,null,null,"排ガス区分",null,null,"キー番号",null,null,null,"尿素タンク容量\n（L）",null,null,"燃料タンク容量\n（L）",null,null,"アタッチメント装着可能質量\n(kg)"]
[1,"フォークリフトディーゼルトルコン",null,null,null,null,null,null,null,"567890",null,null,null,1,null,"㊞",null,null,null,"DFG4-10000",null,null,null,null,null,"2017-03-01",null,"キャタピラー",null,null,"2D2R",null,null,null,null,"97低騒音",null,null,"80D23R",null,null,"1",5335,null,null,1490,null,null,2480,null,null,6600,null,null,null,null,null,null,null,null,null,null,null,null,null,null,null,null,null,null,null,null,null,null,null,null,null,null,null,null,null,null,null,null,null,"ﾎﾟｽﾄﾎﾟｽﾄ\n新長期"]
[null,"4ｔ/3.5ｍ/Fシフター",null,null,null,null,null,null,null,null,null,null,null,"台",null,null,null,null,null,null,null,null,null,null,null,null,null,{"$f":"IF(ISBLANK(AB14),\"\",VLOOKUP(AB14,登録ナンバーなし!CA:CB,2,0))","v":"0020073"},null,null,"500800",null,null,null,null,"二次規制\n適合",null,null,"34565",null,null,null,20,null,null,20,null,null,3000]
[2,"送風機",null,null,null,null,null,null,null,"00511",null,null,null,50,null,"㊞",null,null,null,null,null,null,null,null,null,null,null,null,null,null,null,null,null,null,null,"未対応"]
[null,"300φ/100V",null,null,null,null,null,null,null,null,null,null,null,"台",null,null,null,null,null,null,null,null,null,null,null,null,null,{"$f":"IF(ISBLANK(AB16),\"\",VLOOKUP(AB16,登録ナンバーなし!CA:CB,2,0))","v":""},null,null,null,null,null,null,null,"未対応"]
[3,"発電機DS/S",null,null,null,null,null,null,null,"800001",null,null,null,1,null,"㊞",null,null,null,"G12556000818",null,null,null,null,null,"2017-02-01",null,"三菱重工",null,null,"V3800RE",null,null,null,null,"97低騒音",null,null,"115D31L",null,null,"2"]
[null,"45/37ｋVA　オイルフェンス",null,null,null,null,null,null,null,null,null,null,null,"台",null,null,null,null,null,null,null,null,null,null,null,null,null,{"$f":"IF(ISBLANK(AB18),\"\",VLOOKUP(AB18,登録ナンバーなし!CA:CB,2,0))","v":"0072386"},null,null,"M61570",null,null,null,null,"三次規制\n適合"]
[4,"アスファルトフィニッシャー",null,null,null,null,null,null,null,"9477H",null,null,null,1,null,"㊞",null,null,null,"0789",null,null,null,null,null,"2017-03-01",null,"日野",null,null,"V220B-PK",null,null,null,null,"対象外"]
[null,"1.4-3.0ｍ",null,null,null,null,null,null,null,null,null,null,null,"台",null,null,null,null,null,null,null,null,null,null,null,null,null,{"$f":"IF(ISBLANK(AB20),\"\",VLOOKUP(AB20,登録ナンバーなし!CA:CB,2,0))","v":"0011124"},null,null,"8Y6650",null,null,null,null,"2014年\n基準適合"]
[5,"エンジンコンプレッサー",null,null,null,null,null,null,null,"456789",null,null,null,1,null,"㊞",null,null,null,"38795120",null,null,null,null,null,"2017-02-01",null,"いすゞ",null,null,"L70V5-GEYSS2"]
[null,"50HP定置式アフタークーラー",null,null,null,null,null,null,null,null,null,null,null,"台",null,null,null,null,null,null,null,null,null,null,null,null,null,{"$f":"IF(ISBLANK(AB22),\"\",VLOOKUP(AB22,登録ナンバーなし!CA:CB,2,0))","v":"0011059"},null,null,"7FE3657"]
[6,"軽便バイブレーター",null,null,null,null,null,null,null,"0031E",null,null,null,10,null,"㊞"]
[null,"38ｍｍ/2ｍ/100V",null,null,null,null,null,null,null,null,null,null,null,"本",null,null,null,null,null,null,null,null,null,null,null,null,null,{"$f":"IF(ISBLANK(AB24),\"\",VLOOKUP(AB24,登録ナンバーなし!CA:CB,2,0))","v":""}]
[7,null,null,null,null,null,null,null,null,null,null,null,null,null,null,"㊞"]
[null,null,null,null,null,null,null,null,null,null,null,null,null,null,null,null,null,null,null,null,null,null,null,null,null,null,null,{"$f":"IF(ISBLANK(AB26),\"\",VLOOKUP(AB26,登録ナンバーなし!CA:CB,2,0))","v":""}]
[8,null,null,null,null,null,null,null,null,null,null,null,null,null,null,"㊞"]
[null,null,null,null,null,null,null,null,null,null,null,null,null,null,null,null,null,null,null,null,null,null,null,null,null,null,null,{"$f":"IF(ISBLANK(AB28),\"\",VLOOKUP(AB28,登録ナンバーなし!CA:CB,2,0))","v":""}]
[9,null,null,null,null,null,null,null,null,null,null,null,null,null,null,"㊞"]
[null,null,null,null,null,null,null,null,null,null,null,null,null,null,null,null,null,null,null,null,null,null,null,null,null,null,null,{"$f":"IF(ISBLANK(AB30),\"\",VLOOKUP(AB30,登録ナンバーなし!CA:CB,2,0))","v":""}]
[10,null,null,null,null,null,null,null,null,null,null,null,null,null,null,"㊞"]
[null,null,null,null,null,null,null,null,null,null,null,null,null,null,null,null,null,null,null,null,null,null,null,null,null,null,null,{"$f":"IF(ISBLANK(AB32),\"\",VLOOKUP(AB32,登録ナンバーなし!CA:CB,2,0))","v":""}]
[]
[]
[null,null,null,null,null,null,null,null,null,null,null,null,null,null,null,"上記の通り納品いたします。よろしく御査収下さい。"]
["・原本1部御提出をお願いします"]
["・最新の納品書は　https://www.to-rental.jp/　よりお願いします"]
["・ご不明な点がございましたら納入部門までお問い合わせ下さい。"]

{"sheet":"登録ナンバーなし","index":1,"n_rows":39,"n_cols":86,"rows_kept":39,"cut":false,"hidden":false,"merged":[[31,38,31,40],[35,15,36,31],[31,45,31,47],[31,48,31,50],[31,51,31,53],[31,42,31,44],[32,27,32,29],[32,30,32,34],[32,35,32,37],[31,25,32,26],[31,27,31,29],[31,30,31,34],[31,35,31,37],[32,38,32,41],[29,35,29,37],[29,27,29,29],[29,1,29,8],[29,9,30,12],[29,13,29,14],[29,15,30,18],[29,19,30,24],[23,38,23,40],[25,38,25,40],[27,38,27,40],[29,38,29,40],[28,35,28,37],[27,25,28,26],[27,27,27,29],[27,30,27,34],[27,35,27,37],[28,38,28,41],[30,38,30,41],[27,0,28,0],[27,1,27,8],[27,9,28,12],[27,13,27,14],[27,15,28,18],[27,19,28,24],[31,0,32,0],[31,1,31,8],[31,9,32,12],[31,13,31,14],[31,15,32,18],[31,19,32,24],[32,1,32,8],[32,13,32,14],[29,0,30,0],[30,1,30,8],[30,13,30,14],[30,27,30,29],[30,30,30,34],[30,35,30,37],[29,25,30,26],[29,30,29,34],[26,13,26,14],[26,27,26,29],[26,30,26,34],[28,1,28,8],[28,13,28,14],[28,27,28,29],[28,30,28,34],[25,15,26,18],[25,19,26,24],[25,27,25,29],[26,1,26,8],[25,25,26,26],[25,30,25,34],[25,0,26,0],[25,1,25,8],[25,9,26,12],[25,13,25,14],[24,38,24,41],[26,38,26,41],[23,45,23,47],[23,48,23,50],[23,51,23,53],[24,1,24,8],[24,13,24,14],[24,27,24,29],[24,30,24,34],[24,35,24,37],[23,25,24,26],[23,27,23,29],[23,30,23,34],[23,35,23,37],[23,42,23,44],[24,42,24,44],[24,45,24,47],[24,48,24,53],[26,35,26,37],[25,35,25,37],[21,0,22,0],[21,1,21,8],[21,9,22,12],[21,13,21,14],[21,15,22,18],[21,19,22,24],[21,27,21,29],[22,1,22,8],[23,0,24,0],[23,1,23,8],[23,9,24,12],[23,13,23,14],[23,15,24,18],[23,19,24,24],[22,13,22,14],[22,27,22,29],[20,35,20,37],[19,25,20,26],[19,27,19,29],[19,30,19,34],[19,35,19,37],[19,42,19,44],[22,35,22,37],[21,25,22,26],[21,30,21,34],[21,35,21,37],[21,42,21,44],[22,30,22,34],[20,38,20,41],[22,38,22,41],[19,38,19,40],[21,38,21,40],[19,0,20,0],[19,1,19,8],[19,9,20,12],[19,13,19,14],[19,15,20,18],[19,19,20,24],[18,13,18,14],[18,27,18,29],[18,30,18,34],[20,1,20,8],[20,13,20,14],[20,27,20,29],[20,30,20,34],[18,35,18,37],[17,25,18,26],[17,30,17,34],[17,35,17,37],[17,42,17,44],[17,0,18,0],[17,1,17,8],[17,9,18,12],[17,13,17,14],[17,15,18,18],[17,19,18,24],[17,27,17,29],[18,1,18,8],[18,42,18,44],[18,38,18,41],[17,38,17,40],[15,45,15,47],[15,48,15,50],[15,51,15,53],[16,1,16,8],[16,13,16,14],[16,27,16,29],[16,30,16,34],[16,35,16,37],[15,25,16,26],[15,27,15,29],[15,30,15,34],[15,35,15,37],[15,42,15,44],[16,45,16,47],[16,48,16,53],[16,38,16,41],[15,38,15,40],[15,0,16,0],[15,1,15,8],[15,9,16,12],[15,13,15,14],[15,15,16,18],[15,19,16,24],[13,48,13,50],[13,51,13,53],[14,1,14,8],[14,13,14,14],[14,27,14,29],[14,30,14,34],[14,35,14,37],[13,25,14,26],[14,48,14,53],[13,0,14,0],[13,1,13,8],[13,9,14,12],[13,13,13,14],[13,15,14,18],[13,45,13,47],[14,42,14,44],[14,45,14,47],[16,42,16,44],[12,1,12,8],[12,13,12,14],[12,25,12,26],[12,30,12,34],[12,35,12,37],[13,27,13,29],[13,30,13,34],[13,35,13,37],[11,19,12,24],[11,25,11,26],[10,42,10,50],[12,42,12,44],[12,45,12,47],[12,48,12,53],[13,19,14,24],[11,42,11,44],[11,45,11,47],[11,48,11,50],[11,51,11,53],[13,42,13,44],[11,27,12,29],[11,30,11,34],[11,35,11,37],[12,38,12,41],[14,38,14,41],[11,38,11,40],[13,38,13,40],[11,0,12,0],[11,1,11,8],[11,9,12,12],[11,13,11,14],[11,15,12,18],[7,33,8,35],[7,37,8,42],[7,27,8,27],[7,28,8,28],[7,29,8,29],[7,30,8,30],[7,31,8,31],[7,32,8,32],[7,21,8,21],[7,22,8,22],[7,23,8,23],[7,24,8,24],[7,25,8,25],[7,26,8,26],[7,15,8,15],[7,16,8,16],[7,17,8,17],[7,18,8,18],[7,19,8,19],[7,20,8,20],[6,0,6,10],[6,11,6,21],[6,22,6,32],[6,33,6,35],[6,37,6,50],[7,0,8,10],[7,11,8,11],[7,12,8,12],[7,13,8,13],[7,14,8,14],[7,47,8,47],[7,48,8,48],[7,43,8,43],[7,44,8,44],[7,45,8,45],[7,46,8,46],[7,49,8,49],[7,50,8,53],[0,1,1,16],[0,37,0,39],[0,41,0,53],[1,37,1,53],[2,1,3,16],[2,37,2,53],[3,37,3,39],[3,40,3,50],[3,51,6,53],[4,37,5,50],[18,45,18,47],[18,48,18,53],[17,45,17,47],[17,48,17,50],[17,51,17,53],[20,42,20,44],[20,45,20,47],[20,48,20,53],[22,42,22,44],[22,45,22,47],[22,48,22,53],[21,45,21,47],[21,48,21,50],[21,51,21,53],[19,45,19,47],[19,48,19,50],[19,51,19,53],[26,48,26,53],[25,45,25,47],[25,48,25,50],[25,51,25,53],[32,42,32,44],[32,45,32,47],[32,48,32,53],[28,42,28,44],[28,45,28,47],[28,48,28,53],[30,42,30,44],[30,45,30,47],[30,48,30,53],[27,45,27,47],[27,48,27,50],[27,51,27,53],[29,51,29,53],[29,42,29,44],[26,45,26,47],[25,42,25,44],[26,42,26,44],[29,48,29,50],[29,45,29,47],[27,42,27,44]]}
[null,"　納　品　書　",null,null,null,null,null,null,null,null,null,null,null,null,null,null,null,null,null,null,null,null,null,null,null,null,null,null,null,null,null,null,null,null,null,null,null,"住所",null,null,"〒",null,null,null,null,null,null,null,null,null,null,null,null,null,null,null,null,null,null,null,null,null,null,null,null,null,null,null,null,null,null,null,null,null,null,null,null,null,"メーカー","コード",null,"新・古",null,"騒音区分",null,"排ガス区分"]
[]
[null,"株式会社　東海大阪レンタル　御中",null,null,null,null,null,null,null,null,null,null,null,null,null,null,null,null,null,null,null,null,null,null,null,null,null,null,null,null,null,null,null,null,null,null,null,null,null,null,null,null,null,null,null,null,null,null,null,null,null,null,null,null,null,null,null,null,null,null,null,null,null,null,null,null,null,null,null,null,null,null,null,null,null,null,null,null,"いすゞ","0011059",null,"0：新品",null,"未対応",null,"未対応"]
[null,null,null,null,null,null,null,null,null,null,null,null,null,null,null,null,null,null,null,null,null,null,null,null,null,null,null,null,null,null,null,null,null,null,null,null,null,"社名",null,null,null,null,null,null,null,null,null,null,null,null,null,"印",null,null,null,null,null,null,null,null,null,null,null,null,null,null,null,null,null,null,null,null,null,null,null,null,null,null,"キャタピラー","0020073",null,"1：中古",null,"97低騒音",null,"一般"]
[null,null,null,null,null,null,null,null,null,null,null,null,null,null,null,null,null,null,null,null,null,null,null,null,null,null,null,null,null,null,null,null,null,null,null,null,null,null,null,null,null,null,null,null,null,null,null,null,null,null,null,null,null,null,null,null,null,null,null,null,null,null,null,null,null,null,null,null,null,null,null,null,null,null,null,null,null,null,"クボタ","0072382",null,null,null,"97超低騒音",null,"トンネル"]
[null,null,null,null,null,null,null,null,null,null,null,null,null,null,null,null,null,null,null,null,null,null,null,null,null,null,null,null,null,null,null,null,null,null,null,null,null,null,null,null,null,null,null,null,null,null,null,null,null,null,null,null,null,null,null,null,null,null,null,null,null,null,null,null,null,null,null,null,null,null,null,null,null,null,null,null,null,null,"コマツ","0010021",null,null,null,null,null,"二次規制\n適合"]
["納　入　部　門　名",null,null,null,null,null,null,null,null,null,null,"注　文　番　号（11桁）",null,null,null,null,null,null,null,null,null,null,"納 入 年 月 日",null,null,null,null,null,null,null,null,null,null,"新品・中古区分",null,null,null,null,null,null,null,null,null,null,null,null,null,null,null,null,null,null,null,null,null,null,null,null,null,null,null,null,null,null,null,null,null,null,null,null,null,null,null,null,null,null,null,null,"日野","0011124",null,null,null,null,null,"触媒"]
[null,null,null,null,null,null,null,null,null,null,null,null,null,null,null,null,null,null,null,null,null,null,null,null,null,null,"年",null,null,"月",null,null,"日",null,null,null,null,"取引先コード(7桁)",null,null,null,null,null,null,null,null,null,null,null,null,"000",null,null,null,null,null,null,null,null,null,null,null,null,null,null,null,null,null,null,null,null,null,null,null,null,null,null,null,"三菱重工","0072386",null,null,null,null,null,"三次規制\n適合"]
[null,null,null,null,null,null,null,null,null,null,null,null,null,null,null,null,null,null,null,null,null,null,null,null,null,null,null,null,null,null,null,null,null,null,null,null,null,null,null,null,null,null,null,null,null,null,null,null,null,null,null,null,null,null,null,null,null,null,null,null,null,null,null,null,null,null,null,null,null,null,null,null,null,null,null,null,null,null,"三菱ふそう","0175204",null,null,null,null,null,"ｵﾌﾛｰﾄﾞ"]
[null,null,null,null,null,null,null,null,null,null,null,null,null,null,null,null,null,null,null,null,null,null,null,null,null,null,null,null,null,null,null,null,null,null,null,null,null,null,null,null,null,null,null,null,null,null,null,null,null,null,null,null,null,null,null,null,null,null,null,null,null,null,null,null,null,null,null,null,null,null,null,null,null,null,null,null,null,null,"ヤンマー","0072282",null,null,null,null,null,"2011年\n基準適合"]
["【商　品　詳　細　情　報　　報　告　書】",null,null,null,null,null,null,null,null,null,null,null,null,null,null,null,null,null,null,null,null,null,null,null,null,null,null,null,null,null,null,null,null,null,null,null,null,null,null,null,null,null,"（機械寸法）",null,null,null,null,null,null,null,null,null,null,null,null,null,null,null,null,null,null,null,null,null,null,null,null,null,null,null,null,null,null,null,null,null,null,null,"SUBARU","0011189",null,null,null,null,null,"2014年\n基準適合"]
["No","機種（品名）",null,null,null,null,null,null,null,"東海大阪レンタル\n管理番号",null,null,null,"数量",null,"TOR商品\n確認印",null,null,null,"製造番号",null,null,null,null,null,"製造年月",null,"原動機\nメーカー",null,null,"原動機　型式",null,null,null,null,"騒音区分",null,null,"バッテリーサイズ",null,null,"個数","長さ\nL（ｍｍ）",null,null,"幅\nW （ｍｍ）",null,null,"高さ\nH （ｍｍ）",null,null,"重量 \n機械質量（㎏）",null,null,null,null,null,null,null,null,null,null,null,null,null,null,null,null,null,null,null,null,null,null,null,null,null,null,"UDトラックス","0143321",null,null,null,null,null,"2014年\n基準適合尿素"]
[null,"性能（規格・型式）",null,null,null,null,null,null,null,null,null,null,null,"単位",null,null,null,null,null,null,null,null,null,null,null,"(西暦4桁）",null,null,null,null,"原動機　番号",null,null,null,null,"排ガス区分",null,null,"キー番号",null,null,null,"尿素タンク容量\n（L）",null,null,"燃料タンク容量\n（L）",null,null,"アタッチメント装着可能質量\n(kg)",null,null,null,null,null,null,null,null,null,null,null,null,null,null,null,null,null,null,null,null,null,null,null,null,null,null,null,null,null,null,null,null,null,null,null,null,"ﾎﾟｽﾄ新長期"]
[1,null,null,null,null,null,null,null,null,null,null,null,null,null,null,"㊞",null,null,null,null,null,null,null,null,null,null,null,null,null,null,null,null,null,null,null,null,null,null,null,null,null,null,null,null,null,null,null,null,null,null,null,null,null,null,null,null,null,null,null,null,null,null,null,null,null,null,null,null,null,null,null,null,null,null,null,null,null,null,null,null,null,null,null,null,null,"ﾎﾟｽﾄﾎﾟｽﾄ\n新長期"]
[null,null,null,null,null,null,null,null,null,null,null,null,null,null,null,null,null,null,null,null,null,null,null,null,null,null,null,{"$f":"IF(ISBLANK(AB14),\"\",VLOOKUP(AB14,登録ナンバーなし!CA:CB,2,0))","v":""}]
[2,null,null,null,null,null,null,null,null,null,null,null,null,null,null,"㊞"]
[null,null,null,null,null,null,null,null,null,null,null,null,null,null,null,null,null,null,null,null,null,null,null,null,null,null,null,{"$f":"IF(ISBLANK(AB16),\"\",VLOOKUP(AB16,登録ナンバーなし!CA:CB,2,0))","v":""}]
[3,null,null,null,null,null,null,null,null,null,null,null,null,null,null,"㊞"]
[null,null,null,null,null,null,null,null,null,null,null,null,null,null,null,null,null,null,null,null,null,null,null,null,null,null,null,{"$f":"IF(ISBLANK(AB18),\"\",VLOOKUP(AB18,登録ナンバーなし!CA:CB,2,0))","v":""}]
[4,null,null,null,null,null,null,null,null,null,null,null,null,null,null,"㊞"]
[null,null,null,null,null,null,null,null,null,null,null,null,null,null,null,null,null,null,null,null,null,null,null,null,null,null,null,{"$f":"IF(ISBLANK(AB20),\"\",VLOOKUP(AB20,登録ナンバーなし!CA:CB,2,0))","v":""}]
[5,null,null,null,null,null,null,null,null,null,null,null,null,null,null,"㊞"]
[null,null,null,null,null,null,null,null,null,null,null,null,null,null,null,null,null,null,null,null,null,null,null,null,null,null,null,{"$f":"IF(ISBLANK(AB22),\"\",VLOOKUP(AB22,登録ナンバーなし!CA:CB,2,0))","v":""}]
[6,null,null,null,null,null,null,null,null,null,null,null,null,null,null,"㊞"]
[null,null,null,null,null,null,null,null,null,null,null,null,null,null,null,null,null,null,null,null,null,null,null,null,null,null,null,{"$f":"IF(ISBLANK(AB24),\"\",VLOOKUP(AB24,登録ナンバーなし!CA:CB,2,0))","v":""}]
[7,null,null,null,null,null,null,null,null,null,null,null,null,null,null,"㊞"]
[null,null,null,null,null,null,null,null,null,null,null,null,null,null,null,null,null,null,null,null,null,null,null,null,null,null,null,{"$f":"IF(ISBLANK(AB26),\"\",VLOOKUP(AB26,登録ナンバーなし!CA:CB,2,0))","v":""}]
[8,null,null,null,null,null,null,null,null,null,null,null,null,null,null,"㊞"]
[null,null,null,null,null,null,null,null,null,null,null,null,null,null,null,null,null,null,null,null,null,null,null,null,null,null,null,{"$f":"IF(ISBLANK(AB28),\"\",VLOOKUP(AB28,登録ナンバーなし!CA:CB,2,0))","v":""}]
[9,null,null,null,null,null,null,null,null,null,null,null,null,null,null,"㊞"]
[null,null,null,null,null,null,null,null,null,null,null,null,null,null,null,null,null,null,null,null,null,null,null,null,null,null,null,{"$f":"IF(ISBLANK(AB30),\"\",VLOOKUP(AB30,登録ナンバーなし!CA:CB,2,0))","v":""}]
[10,null,null,null,null,null,null,null,null,null,null,null,null,null,null,"㊞"]
[null,null,null,null,null,null,null,null,null,null,null,null,null,null,null,null,null,null,null,null,null,null,null,null,null,null,null,{"$f":"IF(ISBLANK(AB32),\"\",VLOOKUP(AB32,登録ナンバーなし!CA:CB,2,0))","v":""}]
[]
[]
[null,null,null,null,null,null,null,null,null,null,null,null,null,null,null,"上記の通り納品いたします。よろしく御査収下さい。"]
["・原本1部の御提出をお願いします"]
["・最新の納品書は　https://www.to-rental.jp/　よりお願いします"]
["・ご不明な点がございましたら納入部門までお問い合わせ下さい。"]